powerapps removeif multiple conditions
ih61m bios bin
pietta 1858 barrel
french sabbath school lesson
deltamath hack 2022
ohio police pursuit laws
lifepo4 cells usa
bad ac compressor gauge readings
puzzles and survival troop formation
hohner accordion restoration
tlauncher skins
exclusive value list pet sim x
restrict which virtual machine types can be created in a subscription
super magic eraser illustrator script free download
vape v4 roblox bedwars script pastebin
negotiation role play exercises pdf
virginia elk hunting 2022
mastercam 2022 posts
git clone in azure devops pipeline
convert kotlin to java online

Import failed due to missing dependencies

realme c21y update android 12

watch where the crawdads sing

ghris payslip online login

dolphin dvr pro crack

beck x reader x jade

To use this before trying to install rpm you must have a host which is connected with Internet and has baseline repository. For RHEL nodes the system must be registered with Red Hat Network, while CentOS nodes will have all the default repository files by default available under /etc/yum.repos.d/. I get the error: "Failed to import Profile". The other errors about missing files are curious because you are showing those files exist in the same folder. Or did you move the files into there after you showed the error log?. 2. 3. import pandas. ImportError: Missing required dependencies [ 'numpy' ]. --> ImportError: Missing required dependencies ['numpy']. Bon, désinstallation de python et réinstallation .... ça remarche, mais la loose, tout les packages à réinstaller. Unmet dependencies error can also be caused by a corrupted package database or packages that were not installed properly. The newly added -f parameter will allow the command to correct the broken dependencies issue. You will then be able to install your specific package. Import solution missing dependency. Unanswered. Thank you for your response. I found in new environment, there are no solutions like msdyn_acceleratedsales, msdyn_acceleratedsalessettings and msdyn_acceleratedsalessitemap, but they are exist in the original environment. The installation of a local Debian package failed due to unsatisfied. Android Package Build Fails with "Exit Status 255 instead of 0. The user-provided path <path> does not exist". Android builds fail due to missing jcenter This issue is resolved fully in cordova-android v7.1.4. For reference only: Several java dependencies appear to be missing from https. The command 'samba-tool domain schemaupgrade' fails with the following exception: ERROR(<class 'ModuleNotFoundError'>): uncaught exception - No module named 'markdown' File "/usr/lib/python3.8/site-packages/samba/netcmd/init.py", line 186, in _run return. NOTE : If it keeps failing and you have intermediary network components like proxy devices, corporate filtering/caching mechanisms between your This error can occur due to few root causes. Sometimes, you can exactly pinpoint them, but most times, you need to contact the package author/s of the failed. Dependency ERROR. Check that all required dependencies are deployed in npm repositories. FAILURE: Build failed with an exception. * What went wrong: Execution failed for task ':vaadinBuildFrontend'. > com.vaadin.flow.server.ExecutionFailedException: Npm install has exited. import Input class from org.fedoraproject.helloworld.input package import Run time dependencies will be detected automatically. If it fails, you have to specify them with Requires. We can try to remove these missing dependencies from pom.xml and make Maven stop complaining about them. I updated conda with "conda update conda", but after update i started to fail "import pandas as pd" with error message pandas Missing required dependencies ['numpy'] Working with pandas 0.19.0 and using idp. intelpython3_core includes python itself, numpy, mkl, tbb, and their dependencies. Since the expanded go.mod file needed for module graph pruning includes all of the dependencies needed to load the imports of any package in the main module, if the main module specifies go 1.17 or higher the go tool no longer reads (or even downloads) go.mod files for dependencies if they are not needed in order to complete the requested. Should you get an access denied error when trying to import a dump into MySQL via Directadmin or phpMyAdmin, saying that you need at least one of the All the attempts to import such a dump later failed due to the lack of permissions. Even when we connected to the remote MySQL server as root. Studio tries to import previous .vmoptions and sanitize them to work with the garbage collector used by JDK 11. If that process fails, the IDE may not start for certain users who set custom VM options in the .vmoptions file. To work around this issue, we recommend commenting out custom options in .vmoptions (using the “#” character). Studio tries to import previous .vmoptions and sanitize them to work with the garbage collector used by JDK 11. Compilation errors may arise in Kotlin MPP code due to missing symbols. [Mac OS only] Incremental updates are not applied due to an issue with Gradle file watching on projects saved.

pyp lesson plans for grade 1

Past occurrences of the Required Dependencies error usually had something to do with Vanguard files. Deleting Vanguard entirely from your Updating your system will make sure everything is in top shape and eliminate the odds of receiving the Required Dependencies error due to a software glitch. 2018. 1. 31. · 1. compileOnly should work. What I think is the problem is that you are excluding it globally. Try to exclude it at module level (as a property of particular artifact which pulls it in), rather than globally - it might help. On tangential note, excluding slf4j-api is not best practice. . Importing Binding Files: Failed to create 'WCF-Custom' Transport Component. 2. Install the missing dependencies into the Global Assembly Cache. The reason we get the above error is due to the fact that message type property for multi-part message is not available in the context of the message. Solution. If a job requires certain libraries, make sure to attach the libraries as dependent libraries within job itself. Refer to the following article and steps on how to set up dependent libraries when you create a job. Add libraries as dependent libraries when you create a job ( AWS | Azure ). 1. Open Add Dependent Library dialog: AWS. Importing the multiarray numpy extension module failed. Most likely you are trying to import a failed build of numpy. If problem with pyinstaller build always start with virtual environment. This will isolating projects and dependencies,so will eg not have problem that use wrong version of numpy. Hence i ignored the message and exported the solution. When i imported the solution in Org2, same missing dependencies have been populated preventing the import. I went to the solution.xml and deleted the "<Missing Dependency>-----</Missing Dependency>" and again imported the solution. It worked fine without any errors. It fails because it has a missing dependency: a SQL connection reference. Thing is that this solution was cloned from another solution in which I then deleted the connection reference from the cloned solution, but now I cannot import this solution to another environment due this missing dependency. import/no-extraneous-dependencies 8:23 error 'workbox-webpack-plugin' should be listed in the project's dependencies, not devDependencies Run 'npmi -S cssnano' to add it import/no-extraneous-dependencies 46:39 error Missing trailing comma comma-dangle 47:23 error Missing. 1: Download the mdk from forge official website (zip). 2: Import the project in IntellJ IDEA. 3: try "gradlew buildDependents". Make sure you have the correct version of Forge installed (some packs are heavily dependent on one specific build of Forge). Resolving a dependency inject issue in NestJS by changing the order of the files referenced in an index file. One of the most loved (and occasionally hated) features of Angular is its Dependency Injection (DI) framework. The NestJS team has done a nice job of bringing this DI framework to the. Missing migrations asset_files_migration. requirements: asset_files_migration. [error] Migration media_entity_migration did not meet the requirements. A count of available rows from the source file is compared to the number of imported rows which is not the same in my case due to the plugin I use. Hope You all Are Fine. Today I am installing npm packages and suddenly I got the following error Unable to resolve dependency tree error when installing npm packages in javascript. So Here I am Explain to you all the possible solutions here. [ERROR] Failed to execute goal on project xx-mobi: Could not resolve dependencies for project com.xx-mobi:jar:1.0: Failed to collect dependencies at According to the above error message, the preliminary analysis is that the jar package of the dependent wa-service module is not found in the. Studio tries to import previous .vmoptions and sanitize them to work with the garbage collector used by JDK 11. If that process fails, the IDE may not start for certain users who set custom VM options in the .vmoptions file. To work around this issue, we recommend commenting out custom options in .vmoptions (using the “#” character). This year’s in-person event will be full of valuable insights, information, and connections, with COVID-19 precautions in place for everyone’s health and safety. ImportError: cannot import name 'x1' from partially initialized module 'x'. To resolve the ImportError: Cannot import name, modify the x.py file. Instead of importing the y module at the start of the x.py file, write at the end of the file. def x1 (): print ( 'x1' ) y2 () from y import y2. Now rerun, and you can see the following output. type export ALLOW_MISSING_DEPENDENCIES=TRUE. youll have to do that every time you open a terminal window [Q] [SOS][Galaxy s4 MTK6572] Error 4032 (Enable DRAM FAILED) when trying to flash. Allow_missing_dependencies=true. right after . build/envsetup.sh and before brunch. mlc-mlapis changed the title Strange problem solved: Cypress failed to start. This is usually caused by a missing library or dependency. (Version Cypress 3.1.0 on Windows 10) Strange problem solved: Cypress failed to start. This is usually caused by a missing library or dependency. (Cypress 3.1.0 on Windows 10) Oct 25, 2018. We're facing an issue with the 'Missing Dependencies'. Display the Error " jquery, moment, jquery-ui-dialog, bookacti-js-global-var (missing), bookacti-js-global-functions Hello, if you are using caching tools (plugins, CDN), can you try to clear your cache? This is probably due to a third party plugin. When you attempt to import a solution in Dynamics 365, the import fails due to missing dependencies . If you are installing the solution from the administration center, you may just see a message indicating installation failed . If you are importing a. Instead I realized I could go to the Solution in the dev Environment, go to the Overview page, click on the 3 dots next to Flow, and select this option: That goes ahead and adds these Connections back to the Solution. Yes I don’t use them any more and don’t care for them, but at least this way I can export and import it without an issue. Since I upgraded our hosted Gitlab EE and Gitlab-runner to 10.8,I get job failures with the message There has been a missing dependency failure, check the job log for more information. I can't find any additional information or guidance to understand what the problem is.

les nichols charter review board sarasota

This code can fail due to missing dependencies. Even if it succeeds, the secrets will be stored remotely, which means you have to sign in for every new endpoint. It is important to note that some third-party npm modules may also include native code that can cause this problem. Learn more about missing dependent shared libraries, invalid mex-file, maplelec.dll. During the Maple install there was a message that said something about MATLAB being 32 bit instead of 64 (which is false), but I failed to write down the details of the error. ImportError: Unable to import required dependencies: numpy: Important: please read this for advice on how to solve this issue! Importing the numpy C-extensions failed. This error can happen for many reasons, often due to issues with your setup or how NumPy was installed. Problem: When trying to import the PnP PowerShell module, I got an error message "Import-Module: The specified module 'SharePointPnPPowerShellOnline' was not loaded because no valid module file was found in any module directory". You may face this trouble for other PowerShell modules as well. When I try to import the solution, I get a missing dependency error, complaining of missing dependencies including out-of-the-box fields which definitely exist in UAT and PROD. Is there any way of getting round this, other than clicking Add. The command 'samba-tool domain schemaupgrade' fails with the following exception: ERROR(<class 'ModuleNotFoundError'>): uncaught exception - No module named 'markdown' File "/usr/lib/python3.8/site-packages/samba/netcmd/init.py", line 186, in _run return. 6. 17. · After a some search, I learned the following: “The import of a managed solution will FAIL due to missing dependencies if imported solution publisher is different than the publisher who owns the missing components“. So you will have two options:. how to apply for abandoned vehicle title in nc. - Import the downloaded certificate into the java keystore - change directories to the Java Bin folder of the Java runtime that is being used by Maven. C:\>cd "Program Files\Java\jdk1.8.0_172\bin" - import the cert into the Java keystore. 24889 INFO: Excluding import 'PyQt4' 24892 INFO: Removing import of PyQt4 from module PIL.ImageQt 24893 INFO: Import to be excluded not found: 'FixTk' 24894 So it's not ignoring numpy completely, but is suspect other modules are missing. How do you find out which ones pandas needs?. Since the expanded go.mod file needed for module graph pruning includes all of the dependencies needed to load the imports of any package in the main module, if the main module specifies go 1.17 or higher the go tool no longer reads (or even downloads) go.mod files for dependencies if they are not needed in order to complete the requested. Jun 21, 2019 · Error: At least one required implicit or forwarded dependency was not found. Error: At least one module has an unresolved import due to a missing export function in an implicitly dependent module. Error: Modules with different CPU types were found. Warning: At least one delay-load dependency module was not found.. "/>. ImportError: cannot import name 'x1' from partially initialized module 'x'. To resolve the ImportError: Cannot import name, modify the x.py file. Instead of importing the y module at the start of the x.py file, write at the end of the file. def x1 (): print ( 'x1' ) y2 () from y import y2. Now rerun, and you can see the following output. Instructions After running flow-cadut generate function and then importing functions into a running project results in missing dependency errors from flow-cadut. I am using version 2.x of Nuxt (Vue.JS) with Typesciprt on a Macbook Pro (C. The transaction cannot succeed due to error: execution reverted: Pancake: TRANSFER_FAILED. Make sure you have 30% more tokens in your wallet than While this practice is ill-advised at best, the reason for these projects having done this appears to be due to their tokenomics, in which each. If your import is failing due to a missing package, you can manually install dependencies. Step 2: Install the Numpy Library. After step 1 the next step is to install the NumPy library again. In you command prompt type the following command. Code 0x80040102. Solution. If a job requires certain libraries, make sure to attach the libraries as dependent libraries within job itself. Refer to the following article and steps on how to set up dependent libraries when you create a job. Add libraries as dependent libraries when you create a job ( AWS | Azure ). 1. Open Add Dependent Library dialog: AWS. 2018. 1. 31. · 1. compileOnly should work. What I think is the problem is that you are excluding it globally. Try to exclude it at module level (as a property of particular artifact which pulls it in), rather than globally - it might help. On tangential note, excluding slf4j-api is not best practice. We're facing an issue with the 'Missing Dependencies'. Display the Error " jquery, moment, jquery-ui-dialog, bookacti-js-global-var (missing), bookacti-js-global-functions Hello, if you are using caching tools (plugins, CDN), can you try to clear your cache? This is probably due to a third party plugin. This new local repository will be used only for the dependencies required by your application to be compiled in offline mode. It is unnecessary to copy your everyday repository with all other redundant dependencies which maybe numerous and great in size. In order to create a new local repository. I have a command that is supposed to give information of a selected player. When I go to select the procedure, it says that there are "Missing Dependencies" What am I doing wrong?. [SOLVED] CentOS 8.1.1911: Can't install "nagios-plugins-all-2.3.3-1.el8.x86_64" due to missing PERL dependencies. Issues related to applications and software problems and general support. ... I tried to solve the problem by installing the packages manually but that failed too (please see the output below). ... migrate to Rocky/Alma/OEL. This new local repository will be used only for the dependencies required by your application to be compiled in offline mode. It is unnecessary to copy your everyday repository with all other redundant dependencies which maybe numerous and great in size. In order to create a new local repository.

ranked anovarare pornwide leg mens trousers for swollen legs

hugfun company

Importing the multiarray numpy extension module failed. Most likely you are trying to import a failed build of numpy. If problem with pyinstaller build always start with virtual environment. This will isolating projects and dependencies,so will eg not have problem that use wrong version of numpy. Dependencies on the root package. Package not found in a Jenkins-build. I have a dependency which contains a "repositories" definition in its composer.json, but it seems to be ignored. I have locked a dependency to a specific commit but get unexpected results. Need to override a package version. It fails because it has a missing dependency: a SQL connection reference. Thing is that this solution was cloned from another solution in which I then deleted the connection reference from the cloned solution, but now I cannot import this solution to another environment due this missing dependency. ...failed: General error during conversion: java.lang.NoClassDefFoundError: Unable to load class uk.co.rx14.jlaunchlib.auth.MinecraftAuth due to missing dependency FAILURE: Build failed with an exception. import groovy.transform.Immutable @. Immutable class MinecraftAuthResult { String. Flyway failed to initialize. Migration checksum mismatch. Detected applied migration not resolved locally. Flyway failed to initialize: none of the following migration scripts locations could be found: - classpath Cause: The code is missing a migration script that was previously applied to the database. Sometimes importing a managed solution without getting an unhelpful dependency error can feel like skiing down a black run blindfolded, on one leg and "The import of the solution HoskSolutionName failed. The following components are missing in your system and are not included in the solution. Communication. To establish that I can successfully call a wasm/rust module from ES6 and vice-versa I first tried the simple example in the tutorial above. This exports a single f. ERESOLVE unable to resolve dependency tree npm ERR! npm ERR! While resolving: [email protected] npm ERR!. First, make sure to start your Kodi using admin privileges. On Windows, right-click on Kodi’s icon and select ‘Run as Administrator’. If you’re a Mac user, simply ensure that you have the admin privileges as a user;.

kobold ai reddit

What is missing is the list of dependency defined in the submodules that we do not want to share as source code and that won't be available to be downloaded from Maven public The main idea is to use the exec-maven-plugin to automatically install the dependency for us, replicating the manual activity. I tried importing the OVF package exported from 5.5 again, but this time instead of deploying it directly I first uploaded it as a Content Library template and then tried deploying it from there. Failed to deploy OVF package. Cause: The object or item referred to could not be found. 2019 Community Moderator ElectionNumpy fails to serve as a dependency for pandasPandas not working in R Shiny App (''python setup.py build_ext --inplace" error)ImportError: Missing required dependencies ['numpy'] from Pandas Created Conda Environmentpython only works with sudoUsing. Loading composer repositories with package information Updating dependencies Warning from repo.magento.com: You haven't provided your Magento authentication What I don't understand is I can't seem to find any other reports of others having issues upgrading? Am I missing something basic?. Circular Dependency. So, sometimes it happens that we imported two or modules in our file, and their existence depends on each other. Here, the error occurs as Python is unable to import ImageTK. Now, the reason behind the error is unknown, but you can solve it by importing them separately. Usually, a Jenkins installation fails due to two reasons. This includes missing dependencies or a lack of resources on the server. Let's now check how our It is one of the most important prerequisites while installing Jenkins in the server. Users do not notice this and install Jenkins. And this ends up in. Warning: At least one module has an unresolved import due to a missing export function in a delay-load dependent module. ... 17. · After a some search, I learned the following: “The import of a managed solution will FAIL due to missing dependencies if imported solution publisher is different than the publisher who owns the missing components. Should you get an access denied error when trying to import a dump into MySQL via Directadmin or phpMyAdmin, saying that you need at least one of the All the attempts to import such a dump later failed due to the lack of permissions. Even when we connected to the remote MySQL server as root. Uncaught TypeError: __WEBPACK_IMPORTED_MODULE_0_react___default.a.createContext is not a function at Object.<anonymous> (Context.js:4) at After updating the React and React-Dom modules, if you see an error regarding module build failure such as this: utils.js:303 Uncaught Error: Module. "Cannot resolve dependency" error#. Probably the most common error message is about Nest not being able to resolve dependencies of a provider. A common case would be a module file declaring a token and importing a provider, and the provider import the token constant from the module file. Communication. To establish that I can successfully call a wasm/rust module from ES6 and vice-versa I first tried the simple example in the tutorial above. This exports a single f.

mca telugu movie download moviezwap

Nevertheless even if we knew what was missing, I don’t know any way to restore that missing connection preserving it’s GUID. Meanwhile, to find out what is missing, the simplest way is to do the following (I am using Visual Studio Code for that purpose): Save your app locally, on your computer, Change file extension from *.msapp to *.zip,. Instructions After running flow-cadut generate function and then importing functions into a running project results in missing dependency errors from flow-cadut. I am using version 2.x of Nuxt (Vue.JS) with Typesciprt on a Macbook Pro (C. I tried importing the OVF package exported from 5.5 again, but this time instead of deploying it directly I first uploaded it as a Content Library template and then tried deploying it from there. Failed to deploy OVF package. Cause: The object or item referred to could not be found. Since I upgraded our hosted Gitlab EE and Gitlab-runner to 10.8,I get job failures with the message There has been a missing dependency failure, check the job log for more information. I can't find any additional information or guidance to understand what the problem is. Learn more about missing dependent shared libraries, invalid mex-file, maplelec.dll. During the Maple install there was a message that said something about MATLAB being 32 bit instead of 64 (which is false), but I failed to write down the details of the error. The problem is the system is complaining that the destination environment is missing components that are used as dependencies in the solution. To be more specific, those dependencies are related to components introduced by Dynamics 365 for Marketing which is installed in the source instance, but not in the destination instance. Resolving a dependency inject issue in NestJS by changing the order of the files referenced in an index file. One of the most loved (and occasionally hated) features of Angular is its Dependency Injection (DI) framework. The NestJS team has done a nice job of bringing this DI framework to the.

qvc host dies 2022

Jun 21, 2019 · Error: At least one required implicit or forwarded dependency was not found. Error: At least one module has an unresolved import due to a missing export function in an implicitly dependent module. Error: Modules with different CPU types were found. Warning: At least one delay-load dependency module was not found.. "/>. Feb 14, 2013 · Bug Description. Users report seeing ImportErrors during Horizon startup. One of those is "ImportError: cannot import name base" which is a symptom of the failure to load all dependent modules. The cause therefore would appear to be incomplete or erroneous installation documentation.. "/>. Problem/Motivation When running a migration via one or more drush commands, the dependencies between the migrations are not being recognized as successfully met, even if they have completed execution. Processed 13725 items (13725 created, 0 updated, 0 failed, 0 ignored) - done with 'asset_files_migration' [status] Migration uploaded_document_migration. 24889 INFO: Excluding import 'PyQt4' 24892 INFO: Removing import of PyQt4 from module PIL.ImageQt 24893 INFO: Import to be excluded not found: 'FixTk' 24894 So it's not ignoring numpy completely, but is suspect other modules are missing. How do you find out which ones pandas needs?. Open the Solution in the Source environment where you are importing and Click CONNECTION REFERENCE and add the Connection Reference for the errored flow in the same solution. If issue still persists follow this steps 1. Navigate to https://make.powerapps.com 2. Select Respective Destination Environment 3. An npm install would fail to install the required dependencies for an unknown reason and without error. Since npm install succeeds without error, there wasn't a way to tell if the dependency To be able to use this tool system-wide to install missing dependencies for all your node projects, install it globally. Entities fail to import due to "user missing dependency" related errors. Log In. Export. XML Word Printable. Details. Type: Bug Status:. Missing Dependencies (Missingno-cover-pibby) Dusttoybonnieツ 126674 просмотров. React UseEffect missing...Failed to Launch Chromium on VPS? Unable to install Ease due to missing dependencies Helpful? Please support me on Patreon: With thanks & praise to God. UnZipSFX 5.50 of 17 February 2002, by Info-ZIP ([email protected]). inflating: jre-6u10-linux-i586.rpm error: Failed dependencies: /bin/basename is needed by Why there are a bunch of file commands that are missing? Is this due to each Ubuntu version using different repos?. When you attempt to import a solution in Dynamics 365, the import fails due to missing dependencies . If you are installing the solution from the administration center, you may just see a message indicating installation failed . If you are importing a. ImportError: Unable to import required dependencies: numpy: Important: please read this for advice on how to solve this issue! Importing the numpy C-extensions failed. This error can happen for many reasons, often due to issues with your setup or how NumPy was installed. As mentioned before, this is due to missing libffi-devel on a Centos 7 system. Verified it as well on one of my systems. Could you try again, but before WARNING: renaming "_ssl" since importing it failed: ld.so.1: python: fatal: libssl.so.1.1: open failed: No such file or directory *** WARNING: renaming. Hi , If my understanding is correct there is some dependent field is missing for your entity where "test_sourceidname " field is available , so first go to your unmanaged solution and then removed the entity from unmanaged solution and then add entity again. which wich 14er free sandwich. "The dependent component Attribute (Id=new_mycustomfield) does not exist. Failure trying to associate it with Template (Id=58817a33-e52f-e011-8acb-00155db059be) as a dependency. Missing dependency lookup type = PrimaryKeyLookup" In this case, the attribute new_mycustomfield was deleted in CRM 4.0 though it is still referenced by an e-mail template. The King of Bees 13. Mai 2020 um 18:21. "Load failed due to missing dependencies". No idea what happened. I haven't moved any files. Everything is internal. All I've been doing it messing with the player scene script. Now I can't open any scenes.. "/>. Import solution missing dependency. Unanswered. Thank you for your response. I found in new environment, there are no solutions like msdyn_acceleratedsales, msdyn_acceleratedsalessettings and msdyn_acceleratedsalessitemap, but they are exist in the original environment. The installation of a local Debian package failed due to unsatisfied.

three js 2d example

Nevertheless even if we knew what was missing, I don’t know any way to restore that missing connection preserving it’s GUID. Meanwhile, to find out what is missing, the simplest way is to do the following (I am using Visual Studio Code for that purpose): Save your app locally, on your computer, Change file extension from *.msapp to *.zip,. Note: If you've uploaded your mod pack to a remote server with an FTP client like FileZilla, these "forge missing libraries" might be caused by the FTP client not uploading all of the library files. FileZilla sometimes leaves out important library files when uploading, so check the "Failed Uploads" queue. how-to-fix-missing-dependency-warning-when-using-useeffect-react-hook. ./src/components/CarList.js Line 45: React Hook useEffect has a missing dependency: 'fetchCarList'. Either include it or remove the dependency array react-hooks/exhaustive-deps. Code 0x80040102. Now that you know one of the package that is part of task sequence is missing, it is easy to find out that package. In the SCCM console go to Software Library > Operating Systems > Task Sequences. Select the Task Sequence and at the bottom click References tab. Add the Object ID column if you don’t see it. Data recovery fails when the node_names.txt file is missing in NetBackup SAP HANA at If the library libelf.so. file is missing on the SAP HANA appliance Though backup is working, recovery fails in SAP HANA studio with "No data backups found" (#NOTFOUND in backint.log) due to wrong. JBAS014775: New missing/unsatisfied dependencies: service jboss.naming.context.java.jboss.java 14:51:37,557 ERROR [org.jboss.as.server.deployment.scanner] (DeploymentScanner-threads - 1) {"JBAS014653: Composite operation failed and was rolled back. In local cmd it is working fine , build is success , but in jenkins it is failing ... 4.3.0-ea2/ in the above link i found the pom, with 2 dependencies. which one i should use . where should i replace the url it is always pointing to // repo.maven.apache.org ... org.eclipse.aether.transfer.ArtifactNotFoundException: Could not find artifact. [Y/n] y resolving dependencies looking for conflicting packages :: calligra and calligra-braindump are in conflict. Remove libastro? [y/N] N error: unresolvable package conflicts detected error: failed to prepare transaction (conflicting dependencies) :: marble and libastro are in conflict. When you attempt to import a solution in Dynamics 365, the import fails due to missing dependencies. If you are installing the solution from the administration center, you may just see a message indicating installation failed. If you are importing a. mym fans leak blanket under door truenas import zfs pool grasshopper hydraulic fluid change. Missing migrations asset_files_migration. requirements: asset_files_migration. [error] Migration media_entity_migration did not meet the requirements. A count of available rows from the source file is compared to the number of imported rows which is not the same in my case due to the plugin I use.

get index of element in 2d array python

in Trados 2014,Missing dependency file and Tardos 2007 filter definition not found. Mar 30, 2014. I have the same problem but no solution. Автор темы. Solution for missing dependency. 2. 3. import pandas. ImportError: Missing required dependencies [ 'numpy' ]. --> ImportError: Missing required dependencies ['numpy']. Bon, désinstallation de python et réinstallation .... ça remarche, mais la loose, tout les packages à réinstaller. Solution class missing import. Solution setup JDK. You can check also : Intellij IDEA 2017 unable to Solution Check your module dependencies. This one has symptoms that impact only a single Another reason for unable to resolve class is wrong module scope. In this case it is due to wrong. Unmet dependencies error can also be caused by a corrupted package database or packages that were not installed properly. The newly added -f parameter will allow the command to correct the broken dependencies issue. You will then be able to install your specific package. The transaction cannot succeed due to error: execution reverted: Pancake: TRANSFER_FAILED. Make sure you have 30% more tokens in your wallet than While this practice is ill-advised at best, the reason for these projects having done this appears to be due to their tokenomics, in which each. I also get a "Warning: At least one module has an unresolved import due to a missing export function in a delay-load dependent module" message. Some versions of SHLWAPI.DLL (like the one on Windows XP) have a delay-load dependency on the function WNetRestoreConnectionA in MPR.DLL. Missing delay-load functions are not a problem as long as the. Android Package Build Fails with "Exit Status 255 instead of 0. The user-provided path <path> does not exist". Android builds fail due to missing jcenter This issue is resolved fully in cordova-android v7.1.4. For reference only: Several java dependencies appear to be missing from https. how to take apart a baikal shotgun Import failed due to missing dependencies Jul 20, 2020 · 3) Select 'Open or Import' 4) Open the build.gradle file from the Cerberus project root directory. 5) Select "Open as Project". At this point, the project will open and. After finally installing all of the missing dependencies, i ran into the following error trying to start the keyserver again No surprise evolving dependencies and time would have broken things. Perhaps when I get some more time I'll refactor my original changes to ROS1 Melodic, and try and take a more. 2018. 1. 31. · 1. compileOnly should work. What I think is the problem is that you are excluding it globally. Try to exclude it at module level (as a property of particular artifact which pulls it in), rather than globally - it might help. On tangential note, excluding slf4j-api is not best practice. This may be due to a blocked port, missing dependencies, improper privileges, a crash, or a shutdown by another method. XAMPP Solution: Connection for controluser as defined in your configuration failed. How I Enabled cURL on My XAMPP Server. Problem: When trying to import the PnP PowerShell module, I got an error message "Import-Module: The specified module 'SharePointPnPPowerShellOnline' was not loaded because no valid module file was found in any module directory". You may face this trouble for other PowerShell modules as well. Usually, a Jenkins installation fails due to two reasons. This includes missing dependencies or a lack of resources on the server. Let's now check how our It is one of the most important prerequisites while installing Jenkins in the server. Users do not notice this and install Jenkins. And this ends up in. FAILURE: Build failed with an exception. Since the imported BOM is treated as a regular dependency, it will be propagated transitively. Insights from nexocode team just one click away. Sign up for our newsletter and don't miss out on the updates from our team on engineering and teal culture. Error The following packages have unmet dependencies has plagued Ubuntu users for a while now, and there are more and more sightings of the error on. If the issue is with your Computer or a Laptop you should try using Restoro which can scan the repositories and replace corrupt and missing files. Failed to create user data folder. It fails because it has a missing dependency: a SQL connection reference. Thing is that this solution was cloned from another solution in which I then deleted the connection reference from the cloned solution, but now I cannot import this solution to another environment due this missing dependency. FAILURE: Build failed with an exception. Since the imported BOM is treated as a regular dependency, it will be propagated transitively. Insights from nexocode team just one click away. Sign up for our newsletter and don't miss out on the updates from our team on engineering and teal culture. What is missing is the list of dependency defined in the submodules that we do not want to share as source code and that won't be available to be downloaded from Maven public The main idea is to use the exec-maven-plugin to automatically install the dependency for us, replicating the manual activity. Some common issues with Spring dependency injection and how to fix them. When building Spring (Boot) applications, it's almost inevitable to be hit with the reliable Failed to But even with that test, you will still have cases where dependencies are not wired up correctly, and you need to resolve it. mlc-mlapis changed the title Strange problem solved: Cypress failed to start. This is usually caused by a missing library or dependency. (Version Cypress 3.1.0 on Windows 10) Strange problem solved: Cypress failed to start. This is usually caused by a missing library or dependency. (Cypress 3.1.0 on Windows 10) Oct 25, 2018. how to take apart a baikal shotgun Import failed due to missing dependencies Jul 20, 2020 · 3) Select 'Open or Import' 4) Open the build.gradle file from the Cerberus project root directory. 5) Select "Open as Project". At this point, the project will open and.

b2b cheras pgrm

Studio tries to import previous .vmoptions and sanitize them to work with the garbage collector used by JDK 11. Compilation errors may arise in Kotlin MPP code due to missing symbols. [Mac OS only] Incremental updates are not applied due to an issue with Gradle file watching on projects saved. import pandas as pd import xlwings as xw import datetime as dt import pyodbc. When running the code from Anaconda prompt (and using the desired environment) everything Now my Python scripts runs from a CMD/PS window without the error ImportError: Missing required dependencies ['numpy']. ImportError: Unable to import required dependencies: numpy: Important: please read this for advice on how to solve this issue! Importing the numpy C-extensions failed. This error can happen for many reasons, often due to issues with your setup or how NumPy was installed. ...failed: General error during conversion: java.lang.NoClassDefFoundError: Unable to load class uk.co.rx14.jlaunchlib.auth.MinecraftAuth due to missing dependency FAILURE: Build failed with an exception. import groovy.transform.Immutable @. Immutable class MinecraftAuthResult { String. How to Build Java Project including all Dependencies Using Maven? maven-resources, maven-dependency and maven-jar Plugins ; What is pom.xml (Project Object Model)? Sample pom.xml for you to use in your Dynamic Web Project (Java / J2EE) In Java How to Create .jar / .tar.gz / .zip Archive file using maven-assembly-plugin?. Importing the multiarray numpy extension module failed. Most likely you are trying to import a failed build of numpy. If problem with pyinstaller build always start with virtual environment. This will isolating projects and dependencies,so will eg not have problem that use wrong version of numpy. If a dependency is avoidable through a build option, the error message should tell you what option can be used to avoid it. You may need to disable several features if you want to avoid certain The meson command populates the build directory. This step can fail due to missing dependencies. npm ERR! typeerror Error: Missing required argument #1 npm ERR! typeerror at andLogAndFinish Done Building dependency tree Reading state information... Done The following packages were automatically installed and are no longer required: gyp javascript-common libc-ares2. When you attempt to import a solution in Dynamics 365, the import fails due to missing dependencies . If you are installing the solution from the administration center, you may just see a message indicating installation failed . If you are importing a. pacman' failed to install missing dependencies. [FAILED] [FAILED] This may be due to a missing library or dependency. ImportError: numpy.core.multiarray failed to import.

friends forever meaning in marathi

Remove the VIBs or use Image Builder to create a custom upgrade ISO image that contains the missing dependencies, and try to upgrade again. Why is this an issue and more important will removing the above VIB cause any issue as presumably since it is listed it is in use?. Remove the VIBs or use Image Builder to create a custom upgrade ISO image that contains the missing dependencies, and try to upgrade again. Why is this an issue and more important will removing the above VIB cause any issue as presumably since it is listed it is in use?. Circular Dependency. So, sometimes it happens that we imported two or modules in our file, and their existence depends on each other. Here, the error occurs as Python is unable to import ImageTK. Now, the reason behind the error is unknown, but you can solve it by importing them separately. I updated conda with "conda update conda", but after update i started to fail "import pandas as pd" with error message pandas Missing required dependencies ['numpy'] Working with pandas 0.19.0 and using idp. intelpython3_core includes python itself, numpy, mkl, tbb, and their dependencies. DLL load failed error when importing cv2. I have installed opencv on my windows machine using python 3.6 without any When I look in cv2.pyd with dependency walker, the 3.1 has no dependency to one missing dll. It serves. The issue is due to the missing python3.dll file in Anaconda3. One of those is "ImportError: cannot import name base" which is a symptom of the failure to load all dependent modules. Please include the steps used to install Horizon and its dependencies in future reports or they will not be helpful, thanks! The original bug report follows. Problem/Motivation When running a migration via one or more drush commands, the dependencies between the migrations are not being recognized as successfully met, even if they have completed execution. Processed 13725 items (13725 created, 0 updated, 0 failed, 0 ignored) - done with 'asset_files_migration' [status] Migration uploaded_document_migration. JBAS014775: New missing/unsatisfied dependencies: service jboss.naming.context.java.jboss.java 14:51:37,557 ERROR [org.jboss.as.server.deployment.scanner] (DeploymentScanner-threads - 1) {"JBAS014653: Composite operation failed and was rolled back. # Loop through and install missing dependencies. while true do finished=true # Loop through each We've walked through the process of tracking down the dependencies of the Google Chrome RPM We intelligently route your requests through clean residential IPs, automatically retry failed requests. The package in the repository does not have the dependencies you list. And it installs fine in my 16.04 VM. You can see the package dependencies with: dpkg -I ~/Downloads/xpra-1.0*deb new debian package, version 2.0. size 2556682 bytes: control archive=12650 bytes. Instructions After running flow-cadut generate function and then importing functions into a running project results in missing dependency errors from flow-cadut. I am using version 2.x of Nuxt (Vue.JS) with Typesciprt on a Macbook Pro (C. FAILURE: Build failed with an exception. Since the imported BOM is treated as a regular dependency, it will be propagated transitively. Insights from nexocode team just one click away. Sign up for our newsletter and don't miss out on the updates from our team on engineering and teal culture.

dolby atmos download free

Solution. If a job requires certain libraries, make sure to attach the libraries as dependent libraries within job itself. Refer to the following article and steps on how to set up dependent libraries when you create a job. Add libraries as dependent libraries when you create a job ( AWS | Azure ). 1. Open Add Dependent Library dialog: AWS. Unmet dependencies error can also be caused by a corrupted package database or packages that were not installed properly. The newly added -f parameter will allow the command to correct the broken dependencies issue. You will then be able to install your specific package. It fails because it has a missing dependency: a SQL connection reference. Thing is that this solution was cloned from another solution in which I then deleted the connection reference from the cloned solution, but now I cannot import this solution to another environment due this missing dependency. First, make sure to start your Kodi using admin privileges. On Windows, right-click on Kodi’s icon and select ‘Run as Administrator’. If you’re a Mac user, simply ensure that you have the admin privileges as a user;. Problem/Motivation When running a migration via one or more drush commands, the dependencies between the migrations are not being recognized as successfully met, even if they have completed execution. Processed 13725 items (13725 created, 0 updated, 0 failed, 0 ignored) - done with 'asset_files_migration' [status] Migration uploaded_document_migration. Hi , If my understanding is correct there is some dependent field is missing for your entity where "test_sourceidname " field is available , so first go to your unmanaged solution and then removed the entity from unmanaged solution and then add entity again. which wich 14er free sandwich. Missing migrations asset_files_migration. requirements: asset_files_migration. [error] Migration media_entity_migration did not meet the requirements. A count of available rows from the source file is compared to the number of imported rows which is not the same in my case due to the plugin I use. It is malformed and could be missing the host. Most packages may fail to pip under windows The following error appears: Solution: Create locally Mac found the following exception when using pip3 installation package: The prompt is that the package cannot be installed due to environmental issues. : Build failed due to use of deprecated Android v1 embedding. Import solution missing dependency. Unanswered. Thank you for your response. I found in new environment, there are no solutions like msdyn_acceleratedsales, msdyn_acceleratedsalessettings and msdyn_acceleratedsalessitemap, but they are exist in the original environment. The installation of a local Debian package failed due to unsatisfied. When I implement routes.py and import it in app.py, I am getting the above error. It is there in the link and if this is not supported why is it there. The way I try to prevent this from happening is that I draw a file diagram of my structure and the import dependencies (and where in the code they happen). Solution class missing import. Solution setup JDK. You can check also : Intellij IDEA 2017 unable to Solution Check your module dependencies. This one has symptoms that impact only a single Another reason for unable to resolve class is wrong module scope. In this case it is due to wrong. Tips for resolving unmet dependencies. When the prerequisite scanner returns errors because of failed dependencies, you can run the yum provides feature_name command to learn what is required, and the yum install feature_name command to install the missing dependency. 2. 3. import pandas. ImportError: Missing required dependencies [ 'numpy' ]. --> ImportError: Missing required dependencies ['numpy']. Bon, désinstallation de python et réinstallation .... ça remarche, mais la loose, tout les packages à réinstaller. When trying to use the userRespository I set up I am getting this error. org.springframework.beans.factory.UnsatisfiedDependencyException: Error creating bean with name 'userController': Unsatisfied dependency expressed through field 'userService'; nested exception is. Hi , If my understanding is correct there is some dependent field is missing for your entity where "test_sourceidname " field is available , so first go to your unmanaged solution and then removed the entity from unmanaged solution and then add entity again. which wich 14er free sandwich. YN0014 - yarn_import_failed. A lockfile couldn't be properly imported from a v1 lockfile. This error means that this process failed and Yarn cannot successfully figure out which version of the nmMode has been downgraded to hardlinks-local due to global cache and install folder being on. The solution import process is quite simple. Under "Settings" / "Solutions," click Import, as shown below. Select the zip file of your Solution, and click Import. At this point, Microsoft Dynamics will calculate the solution.xml file and check that all dependent components are included for the import process.

motion to dismiss without prejudice immigration

The problem is the system is complaining that the destination environment is missing components that are used as dependencies in the solution. To be more specific, those dependencies are related to components introduced by Dynamics 365 for Marketing which is installed in the source instance, but not in the destination instance. In the Settings/Preferences dialog (Ctrl+Alt+S), go to Build, Execution, Deployment | Build Tools | Maven | Importing. You can click the icon in the Maven tool window to open the Maven settings. On the Importing page, in the VM options for importer field, increase heap size for the Maven importer. When attempting to import a solution in Dynamics 365, the import fails with the following message: "The import of the solution [solution name] failed . ... [solution name] failed . The following components are missing in your system and are not included in the solution. Import the managed solutions that contain these components ( [name of. . Lootmenu did not have a view due to missing dependencies! Aborting process! I have triple-checked that I have all the latest requirements installed: - Latest Skyrim SE version as of today, did a verify game integrity check as well to make sure no. Missing Dependencies (Missingno-cover-pibby) Dusttoybonnieツ 126674 просмотров. React UseEffect missing...Failed to Launch Chromium on VPS? Unable to install Ease due to missing dependencies Helpful? Please support me on Patreon: With thanks & praise to God. then the package still fail. Reproducible: Always. Steps to Reproduce: 1.emerge dev-perl/gtk2-perl 2. 3. Actual Results: BlackPearl adamaru # emerge dev-perl/gtk2-perl Calculating dependencies... done! >>> Verifying ebuild manifests >>>. Emerging (1 of 1) dev-perl/gtk2-perl-1.222 * Gtk2-1.222.tar.gz. It worked fine without any errors. NOTE: If your import is failing due to a missing package, you can manually install dependencies using either !pip or !apt. To view examples of installing some common dependencies, click the "Open Examples" button below. When you attempt to import a solution in Dynamics 365, the import fails due to missing. Dependency ERROR. Check that all required dependencies are deployed in npm repositories. FAILURE: Build failed with an exception. * What went wrong: Execution failed for task ':vaadinBuildFrontend'. > com.vaadin.flow.server.ExecutionFailedException: Npm install has exited. new f550 dump truck for sale discord emoji picker vue; just trains voyager. When trying to use the userRespository I set up I am getting this error. org.springframework.beans.factory.UnsatisfiedDependencyException: Error creating bean with name 'userController': Unsatisfied dependency expressed through field 'userService'; nested exception is. If it is not desired to be shipped, then the best practice is to remove it from your source environment. So you can import the solution by manual removing the <missing dependency> tag in the solution.xml file. Hope this helps. Best regards, Akash. Please mark as verified if the answer is helpful. To solve circular dependencies, use the module in a function when we needed it. Breaking a circular dependency makes the code cleaner Python can detect circular dependencies and prevent the infinite loop of imports. Basically, what happens is that an empty placeholder is created for the module. To use this before trying to install rpm you must have a host which is connected with Internet and has baseline repository. For RHEL nodes the system must be registered with Red Hat Network, while CentOS nodes will have all the default repository files by default available under /etc/yum.repos.d/. . This new local repository will be used only for the dependencies required by your application to be compiled in offline mode. It is unnecessary to copy your everyday repository with all other redundant dependencies which maybe numerous and great in size. In order to create a new local repository.

electrical switch room requirements

2) Due to Missing Dependency. Sometimes, you do need a database but you forgot to include the driver JAR file into the classpath, which can also cause this error. For example, you have specified the following properties in the application.properties, Spring Boots configuration file but didn't include the. Past occurrences of the Required Dependencies error usually had something to do with Vanguard files. Deleting Vanguard entirely from your Updating your system will make sure everything is in top shape and eliminate the odds of receiving the Required Dependencies error due to a software glitch. Package dependency errors can occur in Ubuntu after installing some apps. Decisions made by users during installation or system level problems out of This article will list a few methods that can be used to prevent and fix these kinds of dependency errors. Note that the methods suggested below are not. Import solution missing dependency. Unanswered. Thank you for your response. I found in new environment, there are no solutions like msdyn_acceleratedsales, msdyn_acceleratedsalessettings and msdyn_acceleratedsalessitemap, but they are exist in the original environment. The installation of a local Debian package failed due to unsatisfied. Also under "SDK Updates Sites" I get an error with the "Android Repository" under "Enabled" -> red sign with the message "IO exception while downloading manifest". Here is the problem I currently get in Android Studio: ERROR: Unable to resolve dependency for ':[email protected]/compileClasspath': Could. 2. 3. import pandas. ImportError: Missing required dependencies [ 'numpy' ]. --> ImportError: Missing required dependencies ['numpy']. Bon, désinstallation de python et réinstallation .... ça remarche, mais la loose, tout les packages à réinstaller. First, make sure to start your Kodi using admin privileges. On Windows, right-click on Kodi’s icon and select ‘Run as Administrator’. If you’re a Mac user, simply ensure that you have the admin privileges as a user;. import java.io.File import java.io.IOException import java.text.SimpleDateFormat import java.util.Iterator import java org.codehaus.groovy.control.MultipleCompilationErrorsException: startup failed: General See the missing dependency part? It is probably bundled in the POI zip under /lib. "Import failed due to missing dependencies for <app name>". In this case, you can choose to install the component library solution first, or bundle the component library with the solution that contains the canvas app. Either of the steps would ensure the app will have the dependency created in the target environment. 17. · After a some search, I learned the following: “The import of a managed solution will FAIL due to missing dependencies if imported solution publisher is different than the publisher who owns the missing components“. So you will have two options:. "/> ... 2021 · Import of solution fails due to missing components Symptoms. The import. import React, {useEffect, useState} from 'react' One way to get around the warning "React Hook useEffect has a missing dependency" is to disable the eslint rule for a line. This removes the warning because the hook no longer has a dependency on the object because it is declared inside of it. Making sometimes fails due to the lack of dependencies of the package. Dependencies are not always resolved automatically. The last line of the log mentions "ERROR: 'pacman' failed to install missing dependencies." This is because of the lack of "Dependencies". The solution import process is quite simple. Under "Settings" / "Solutions," click Import, as shown below.Select the zip file of your Solution, and click Import.At this point, Microsoft Dynamics will calculate the solution.xml file and check that all dependent components are included for the import process. Aug 22, 2011 · If you already installed the package with missed dependencies,. If your import is failing due to a missing package, you can manually install dependencies. Step 2: Install the Numpy Library. After step 1 the next step is to install the NumPy library again. In you command prompt type the following command. Code 0x80040102. Note: If you've uploaded your mod pack to a remote server with an FTP client like FileZilla, these "forge missing libraries" might be caused by the FTP client not uploading all of the library files. FileZilla sometimes leaves out important library files when uploading, so check the "Failed Uploads" queue. In Python "ImportError: cannot import name" error generally occurs when the imported class is not accessible, or the imported class is in a circular dependency. To sum things up, you can solve the "ImportError: Cannot import name X" Error by resolving the circular dependencies. You can do that. ReactiveWebApplicationContext due to missing ReactiveWebServerFactory bean. [ERROR] Failed to execute goal on project dcc-edge: Could not resolve dependencies for project gov.dcc.adapter:dcc-edge:jar:0.1.-SNAPSHOT: Failed to collect dependencies at org.springframework.cloud. The most important part of this post is not a copy/past solution, but rather understanding what we're doing. Fall-back version to restore dependencies compatibility. Debugging and Fixing Dependencies and Packages. In this example I'm going to be fixing libsdl2-dev. Solution. If a job requires certain libraries, make sure to attach the libraries as dependent libraries within job itself. Refer to the following article and steps on how to set up dependent libraries when you create a job. Add libraries as dependent libraries when you create a job ( AWS | Azure ). 1. Open Add Dependent Library dialog: AWS. I try importing this with the dependencies in place and it fails. I take off the dependencies and then 40 minutes later it has successfully imported, leaving me totally confused why Dynamics 365.

plasma cutter amps thickness chart

The problem is the system is complaining that the destination environment is missing components that are used as dependencies in the solution. To be more specific, those dependencies are related to components introduced by Dynamics 365 for Marketing which is installed in the source instance, but not in the destination instance. When you attempt to import a solution in Dynamics 365, the import fails due to missing dependencies. If you are installing the solution from the administration center, you may just see a message indicating installation failed. If you are importing a. mym fans leak blanket under door truenas import zfs pool grasshopper hydraulic fluid change. ReactiveWebApplicationContext due to missing ReactiveWebServerFactory bean. [ERROR] Failed to execute goal on project dcc-edge: Could not resolve dependencies for project gov.dcc.adapter:dcc-edge:jar:0.1.-SNAPSHOT: Failed to collect dependencies at org.springframework.cloud. 0: 1280 log.warning("Missing libxcrypt dependency, configure may fail due to missing crypt.h") 1281 if core.distro_version >= '20.0': 1282 cmd4 1424 cups.getSystemPPDs() 1425 except ImportError: 1426 log.error("Failed to Import Cups") 1427 except : 1428 log.debug("Could not update PPD cache. Imported value is undefined when it belongs to a cycle - it happens for both expressions and function definitions. It might appear that the import is Dependencies in a project can be represented as a directed graph where the beginning of an edge is the importing module (file where import is used). Hi , If my understanding is correct there is some dependent field is missing for your entity where "test_sourceidname " field is available , so first go to your unmanaged solution and then removed the entity from unmanaged solution and then add entity again. which wich 14er free sandwich. Removed missing dependency between < MissingDependencies> tags for missing connection reference in 'solution.xml'. Zip the folder with changes to files. Import in same environment to update old solution. This method also works if you cannot delete certain unused items due dependencies. After doing this, you can open the solution and delete the. @getsbydev Which. Maven dependencies missing Follow. Henry Story. Created January 04, 2011 01:07. I have noticed that a lot of maven imports are missing. They are somehow acknowledged by IDEA 10.0.1 Build IC-99.32, that is some things work and others don't. Should you get an access denied error when trying to import a dump into MySQL via Directadmin or phpMyAdmin, saying that you need at least one of the All the attempts to import such a dump later failed due to the lack of permissions. Even when we connected to the remote MySQL server as root. After trying to install either, it fails. I did notice that neither the source nor requirements listed the What is the required version for either one of these dependencies to enable pdfump() to work as it How to reproduce. from scapy.all import sniff try: import pyx except ImportError as e: print(f". Unmet dependencies error can also be caused by a corrupted package database or packages that were not installed properly. The newly added -f parameter will allow the command to correct the broken dependencies issue. You will then be able to install your specific package. Dependency ERROR. Check that all required dependencies are deployed in npm repositories. FAILURE: Build failed with an exception. * What went wrong: Execution failed for task ':vaadinBuildFrontend'. > com.vaadin.flow.server.ExecutionFailedException: Npm install has exited. Instead I realized I could go to the Solution in the dev Environment, go to the Overview page, click on the 3 dots next to Flow, and select this option: That goes ahead and adds these Connections back to the Solution. Yes I don’t use them any more and don’t care for them, but at least this way I can export and import it without an issue. Imported value is undefined when it belongs to a cycle - it happens for both expressions and function definitions. It might appear that the import is Dependencies in a project can be represented as a directed graph where the beginning of an edge is the importing module (file where import is used). This year’s in-person event will be full of valuable insights, information, and connections, with COVID-19 precautions in place for everyone’s health and safety. Rootcause: This error occurs due to versioning issue in package.json file. How to solve this error: There are two way to resolve this dependency tree issue Revert version of npm or any other packageUse legacy Resolve any type of Error Handling. Unable to resolve dependency tree npm. Rootcause. Adding the missing lib with yarn add -D utility-types solved it. But it should be added to the dev dependencies. I notice you only use utility-types in one place, for Subtract - maybe you can remove that dependency and just try Omit/Extract? Not sure if that would work, if not, maybe you just need to. Nevertheless even if we knew what was missing, I don’t know any way to restore that missing connection preserving it’s GUID. Meanwhile, to find out what is missing, the simplest way is to do the following (I am using Visual Studio Code for that purpose): Save your app locally, on your computer, Change file extension from *.msapp to *.zip,. ImportError: cannot import name 'x1' from partially initialized module 'x'. To resolve the ImportError: Cannot import name, modify the x.py file. Instead of importing the y module at the start of the x.py file, write at the end of the file. def x1 (): print ( 'x1' ) y2 () from y import y2. Now rerun, and you can see the following output. Hi , If my understanding is correct there is some dependent field is missing for your entity where "test_sourceidname " field is available , so first go to your unmanaged solution and then removed the entity from unmanaged solution and then add entity again. which wich 14er free sandwich. There has been quite a few reports from developers seeing failed builds due to missing gradle dependencies in Bintray JCenter. If its the same issue as described here, this will also reproduce locally by clearing your cache. The error in the build logs should look similar to the following. pacman' failed to install missing dependencies. [FAILED] [FAILED] This may be due to a missing library or dependency. ImportError: numpy.core.multiarray failed to import. Loading composer repositories with package information Updating dependencies Warning from repo.magento.com: You haven't provided your Magento authentication What I don't understand is I can't seem to find any other reports of others having issues upgrading? Am I missing something basic?.

write a python program to reverse a number and also find the sum of digits of the numberweb development bootcamp onlinepinturas de mujeres bellas

hattie top ten strategies


jsr thb151n





2 senyakanoc bnakaran zeytunum

  • too many login attempts valorant reddit

    husqvarna diagnostic tool
  • fomapan 100 rodinal stand development

    android 12 bluetooth permission changes
  • deviantart snake squeeze

    football manager 2022 pack
  • contour farming examples

    gy6 fuel system diagram
  • microsoft classic solitaire collection

    stuck at shutting down group policy client
  • john deere gator cylinder head torque specs

    smsl sanskrit pro

openbullet config pack 2022 download
Learn more about missing dependent shared libraries, invalid mex-file, maplelec.dll. During the Maple install there was a message that said something about MATLAB being 32 bit instead of 64 (which is false), but I failed to write down the details of the error.
Removed missing dependency between < MissingDependencies> tags for missing connection reference in 'solution.xml'. Zip the folder with changes to files. Import in same environment to update old solution. This method also works if you cannot delete certain unused items due dependencies. After doing this, you can open the solution and delete the. @getsbydev Which
Since the expanded go.mod file needed for module graph pruning includes all of the dependencies needed to load the imports of any package in the main module, if the main module specifies go 1.17 or higher the go tool no longer reads (or even downloads) go.mod files for dependencies if they are not needed in order to complete the requested ...
17. · After a some search, I learned the following: “The import of a managed solution will FAIL due to missing dependencies if imported solution publisher is different than the publisher who owns the missing components“. So you will have two options:. "/> ... 2021 · Import of solution fails due to missing components Symptoms. The import ...
Also under "SDK Updates Sites" I get an error with the "Android Repository" under "Enabled" -> red sign with the message "IO exception while downloading manifest". Here is the problem I currently get in Android Studio: ERROR: Unable to resolve dependency for ':[email protected]/compileClasspath': Could...